- 积分
- 5
贡献24
飞刀4 FD
注册时间2015-11-9
在线时间1 小时

 
扫一扫,手机访问本帖 
|
make[2]: 正在进入目录 `/home/vmuser/forlinx/work/tslib/tests'
gcc -DHAVE_CONFIG_H -I. -I.. -I../src -DGCC_HASCLASSVISIBILITY -O2 -Wall -W -MT tsalibrate.c
ts_calibrate.c: 在函数‘main’中:
ts_calibrate.c:234:9: 警告: 忽略声明有 warn_unused_result 属性的‘write’的返回值 [-Wu
In file included from /usr/include/fcntl.h:252:0,
from /usr/include/x86_64-linux-gnu/sys/fcntl.h:1,
from ts_calibrate.c:20:
在函数‘open’中,
内联自‘main’于 ts_calibrate.c:227:11:
/usr/include/x86_64-linux-gnu/bits/fcntl2.h:51:24: 错误: 调用‘__open_missing_mode’,
在函数‘open’中,
内联自‘main’于 ts_calibrate.c:229:11:
/usr/include/x86_64-linux-gnu/bits/fcntl2.h:51:24: 错误: 调用‘__open_missing_mode’,
make[2]: *** [ts_calibrate.o] 错误 1
make[2]:正在离开目录 `/home/vmuser/forlinx/work/tslib/tests'
make[1]: *** [all-recursive] 错误 1
make[1]:正在离开目录 `/home/vmuser/forlinx/work/tslib'
make: *** [all] 错误 2
** install in etc
make[1]: 正在进入目录 `/home/vmuser/forlinx/work/tslib/etc'
make[2]: 正在进入目录 `/home/vmuser/forlinx/work/tslib/etc'
|
|